U(Cp)3(i-Bu)
- Formula: C19H24U
- Molecular weight: 490.4228

Condensed phase thermochemistry data

Data compiled by: José A. Martinho Simões
Quantity | Value | Units | Method | Reference | Comment |
---|---|---|---|---|---|
ΔfH°solid | 136. ± 29. | kJ/mol | Review | Martinho Simões | |
Quantity | Value | Units | Method | Reference | Comment |
ΔcH°solid | -12234. ± 29. | kJ/mol | CC-SB | Tel'noi, Rabinovich, et al., 1989 |

Phase change data

Data compiled by: José A. Martinho Simões
Quantity | Value | Units | Method | Reference | Comment |
---|---|---|---|---|---|
ΔsubH° | 121. ± 8. | kJ/mol | CC-SB | Tel'noi, Rabinovich, et al., 1989 |

Gas phase thermochemistry data

Data compiled by: José A. Martinho Simões
Quantity | Value | Units | Method | Reference | Comment |
---|---|---|---|---|---|
ΔfH°gas | 257. ± 30. | kJ/mol | Review | Martinho Simões |

References

Martinho Simões
Martinho Simões, J.A.,
Private communication (see http://webbook.nist.gov/chemistry/om/). [all data]
Tel'noi, Rabinovich, et al., 1989
Tel'noi, V.I.; Rabinovich, I.B.; Larina, V.N.; Leonov, M.R.; Solov'eva, G.V.,
Radiokhimiya, 1989, 31, 38. [all data]