U(OMe)6
- Formula: C6H18O6U
- Molecular weight: 424.2324

Condensed phase thermochemistry data

Data compiled by: José A. Martinho Simões
Quantity | Value | Units | Method | Reference | Comment |
---|---|---|---|---|---|
ΔfH°solid | -1922. ± 21. | kJ/mol | Review | Martinho Simões | |
Quantity | Value | Units | Method | Reference | Comment |
ΔcH°solid | -4203. ± 21. | kJ/mol | CC-SB | Tel'noi, Larina, et al., 1991 |

Phase change data

Data compiled by: José A. Martinho Simões
Quantity | Value | Units | Method | Reference | Comment |
---|---|---|---|---|---|
ΔsubH° | 102.9 ± 8.4 | kJ/mol | CC-SB | Tel'noi, Larina, et al., 1991 |

Gas phase thermochemistry data

Data compiled by: José A. Martinho Simões
Quantity | Value | Units | Method | Reference | Comment |
---|---|---|---|---|---|
ΔfH°gas | -1819. ± 23. | kJ/mol | Review | Martinho Simões |

References

Martinho Simões
Martinho Simões, J.A.,
Private communication (see http://webbook.nist.gov/chemistry/om/). [all data]
Tel'noi, Larina, et al., 1991
Tel'noi, V.I.; Larina, V.N.; Kuznetsov, N.T.; Sevast'yanov, V.G.; Krasnodubskaya, S.V.; Filatov, I.Yu.,
Vysokochist. Veshchestva, 1991, 194.. [all data]