Mg(neo-Pe)2
- Formula: C10H22Mg
- Molecular weight: 166.5867

Gas phase thermochemistry data

Data compiled by: José A. Martinho Simões
Quantity | Value | Units | Method | Reference | Comment |
---|---|---|---|---|---|
ΔfH°gas | -74.3 ± 7.6 | kJ/mol | Review | Martinho Simões |

Reaction thermochemistry data

Data compiled by: José A. Martinho Simões
Individual Reactions
C10H22Mg (cr) + (g) +
(l) = 2
(l) + Br2Mg (cr)
By formula: C10H22Mg (cr) + H2 (g) + Br2 (l) = 2C5H12 (l) + Br2Mg (cr)
Quantity | Value | Units | Method | Reference | Comment |
---|---|---|---|---|---|
ΔrH° | -669.6 ± 6.6 | kJ/mol | RSC | Akkerman, Schat, et al., 1983 |
C20H44Mg2 (g) = 2C10H22Mg (g)
By formula: C20H44Mg2 (g) = 2C10H22Mg (g)
Quantity | Value | Units | Method | Reference | Comment |
---|---|---|---|---|---|
ΔrH° | 142.0 ± 5.6 | kJ/mol | KC-MS | Akkerman, Schat, et al., 1983 |

Condensed phase thermochemistry data

Data compiled by: José A. Martinho Simões
Quantity | Value | Units | Method | Reference | Comment |
---|---|---|---|---|---|
ΔfH°solid | -236.8 ± 7.2 | kJ/mol | Review | Martinho Simões |

Phase change data

Data compiled by: José A. Martinho Simões
Quantity | Value | Units | Method | Reference | Comment |
---|---|---|---|---|---|
ΔsubH° | 162.5 ± 2.5 | kJ/mol | RSC | Akkerman, Schat, et al., 1983 | The enthalpy of sublimation refers to the equilibrium solid=gaseous monomer. The value for the equilibrium solid=gaseous dimer is 183.0±2.5 Akkerman, Schat, et al., 1983 |

References

Martinho Simões
Martinho Simões, J.A.,
Private communication (see http://webbook.nist.gov/chemistry/om/). [all data]
Akkerman, Schat, et al., 1983
Akkerman, O.S.; Schat, G.; Evers, E.A.I.M.; Bickelhaupt, F.,
Recl. Trav. Chim. Pays-Bas, 1983, 102, 109. [all data]