CsC2H
- Formula: C2HCs
- Molecular weight: 157.9348

Reaction thermochemistry data

Data compiled by: José A. Martinho Simões
Individual Reactions
C2HCs (cr) + (l) = (
• 1031
) (solution) +
(g)
By formula: C2HCs (cr) + H2O (l) = (HCsO • 1031H2O) (solution) + C2H2 (g)
Quantity | Value | Units | Method | Reference | Comment |
---|---|---|---|---|---|
ΔrH° | -12.9 ± 0.2 | kcal/mol | RSC | Ader and Hubbard, 1973 | Please also see Pedley and Rylance, 1977. |

Condensed phase thermochemistry data

Data compiled by: José A. Martinho Simões

Quantity Value Units Method Reference Comment
Δfsolid80.7 ± 4.1kJ/molReviewMartinho Simões

References

Ader and Hubbard, 1973
Ader, M.; Hubbard, W.N.,
J. Chem. Thermodyn., 1973, 5, 607. [all data]
Pedley and Rylance, 1977
Pedley, J.B.; Rylance, J.,
Computer Analysed Thermochemical Data: Organic and Organometallic Compounds, University of Sussex, Brigton, 1977. [all data]