NaOEt

Reaction thermochemistry data

Data compiled by: José A. Martinho Simões

Individual Reactions

C2H5NaO (cr) + 0.5(Sulfuric Acid • 1100Water) (solution) = Ethanol (solution) + 0.5sodium sulphate (solution)

By formula: C2H5NaO (cr) + 0.5(H2O4S • 1100H2O) (solution) = C2H6O (solution) + 0.5Na2O4S (solution)

Quantity Value Units Method Reference Comment
Δr-118.4 ± 3.8kJ/molRSCBlanchard, Joly, et al., 1974solvent: Sulphuric acid aqueous solution; The reaction enthalpy relies on -10.6 kJ/mol for the enthalpy of solution of EtOH(l) and on 9.97±0.04 for the enthalpy of solution of Na2SO4(cr) Blanchard, Joly, et al., 1974. A value of -490.8 ± 5.9 kJ/mol was derived in Blanchard, Joly, et al., 1974 for the enthalpy of formation. However, this value is affected by a calculation error. Also, the authors have not accounted for the acid dilution (this correction could not be made in the present database, due to lack of information). These problems were also noted in the data compilations Tel'noi and Rabinovich, 1980 and Wagman, Evans W.H., et al., 1982, where the values quoted for the enthalpy of formation, which rely on the experimental data reported in Blanchard, Joly, et al., 1974, are -410.0 ± 4.2 kJ/mol and -413.8 kJ/mol, respectively. See also comments in Liebman, Martinho Simões, et al., 1995

C2H5NaO (cr) + Water (l) = Sodium hydroxide (cr) + Ethanol (l)

By formula: C2H5NaO (cr) + H2O (l) = HNaO (cr) + C2H6O (l)

Quantity Value Units Method Reference Comment
Δr-5.7 ± 1.9kJ/molRSCLeal, Pires de Matos, et al., 1991

References

Blanchard, Joly, et al., 1974
Blanchard, J.M.; Joly, R.D.; Lettoffe, J.M.; Perachon, G.; Thourey, J., J. Chim. Phys. Phys.-Chim. Biol., 1974, 71, 472. [all data]

Tel'noi and Rabinovich, 1980
Tel'noi, V.I.; Rabinovich, I.B., Russ. Chem. Rev., 1980, 49, 603. [all data]

Wagman, Evans W.H., et al., 1982
Wagman, D.D.; Evans W.H.; Parker, V.B.; Schumm, R.H.; Halow, I.; Bailey, S.M.; Churney, K.L.; Nuttall, R.L., The NBS Tables of Chemical Thermodynamic Properties; J. Phys. Chem. Ref. Data, 1982, 11, Suppl. 2. [all data]

Liebman, Martinho Simões, et al., 1995
Liebman, J.F.; Martinho Simões, J.A.; Slayden, S.W., In Lithium Chemistry: A Theoretical and Experimental Overview Wiley: New York, Sapse, A.-M.; Schleyer, P. von Ragué, ed(s)., 1995. [all data]

Leal, Pires de Matos, et al., 1991
Leal, J.P.; Pires de Matos, A.; Martinho Simões, J.A., J. Organometal. Chem., 1991, 403, 1. [all data]