LiOEt
- Formula: C2H5LiO
- Molecular weight: 52.002

Reaction thermochemistry data

Data compiled by: José A. Martinho Simões
Individual Reactions
C2H5LiO (cr) + 0.5( • 1100
) (solution) = 0.5Li2O4S (solution) +
(solution)
By formula: C2H5LiO (cr) + 0.5(H2O4S • 1100H2O) (solution) = 0.5Li2O4S (solution) + C2H6O (solution)
Quantity | Value | Units | Method | Reference | Comment |
---|---|---|---|---|---|
ΔrH° | -27.15 ± 0.31 | kcal/mol | RSC | Blanchard, Joly, et al., 1974 | solvent: Sulphuric acid aqueous solution; The reaction enthalpy relies on -2.53 kcal/mol for the enthalpy of solution of EtOH(l) and on -17.5±0.3 for the enthalpy of solution of Li2SO4(cr) Blanchard, Joly, et al., 1974. |
C2H5LiO (cr) + ( • 552
) (solution) =
(l) +
(cr)
By formula: C2H5LiO (cr) + (HCl • 552H2O) (solution) = C2H6O (l) + ClLi (cr)
Quantity | Value | Units | Method | Reference | Comment |
---|---|---|---|---|---|
ΔrH° | -10.1 ± 0.93 | kcal/mol | RSC | Leal and Martinho Simões, 1993 |
C2H5LiO (cr) + (l) = HLiO (cr) +
(l)
By formula: C2H5LiO (cr) + H2O (l) = HLiO (cr) + C2H6O (l)
Quantity | Value | Units | Method | Reference | Comment |
---|---|---|---|---|---|
ΔrH° | -0.86 ± 0.60 | kcal/mol | RSC | Leal and Martinho Simões, 1993 |

Condensed phase thermochemistry data

Data compiled by: José A. Martinho Simões

Quantity Value Units Method Reference Comment
Δfsolid-108.8 ± 0.33kcal/molReviewMartinho SimõesA value of -127.2 ± 1.0 kcal/mol was derived in Blanchard, Joly, et al., 1974 for the enthalpy of formation. However, this value is affected by a calculation error. Also, the authors have not accounted for the acid dilution (this correction could not be made in the present database, due to lack of information). These problems were also noted in the data compilations Tel'noi and Rabinovich, 1980 and Wagman, Evans W.H., et al., 1982, where the values quoted for the enthalpy of formation, which rely on the experimental data reported in Blanchard, Joly, et al., 1974, are -109.0 ± 1.0 kcal/mol and -109.1 kcal/mol, respectively. See also comments in Liebman, Martinho Simões, et al., 1995
Δfsolid-114.0 ± 0.96kcal/molReviewMartinho Simões
Δfsolid-113.1 ± 0.60kcal/molReviewMartinho Simões
Δfsolid-113.6 ± 0.57kcal/molReviewMartinho SimõesSelected data. Average of the values from Leal and Martinho Simões, 1993

References

Blanchard, Joly, et al., 1974
Blanchard, J.M.; Joly, R.D.; Lettoffe, J.M.; Perachon, G.; Thourey, J.,
J. Chim. Phys. Phys.-Chim. Biol., 1974, 71, 472. [all data]
Leal and Martinho Simões, 1993
Leal, J.P.; Martinho Simões, J.A.,
J. Organometal. Chem., 1993, 460, 131. [all data]