LiOMe
- Formula: CH3LiO
- Molecular weight: 37.975

Reaction thermochemistry data

Data compiled by: José A. Martinho Simões
Individual Reactions
CH3LiO (cr) + (l) = HLiO (cr) +
(l)
By formula: CH3LiO (cr) + H2O (l) = HLiO (cr) + CH4O (l)
Quantity | Value | Units | Method | Reference | Comment |
---|---|---|---|---|---|
ΔrH° | -5.2 ± 2.3 | kJ/mol | RSC | Leal and Martinho Simões, 1993 |

Condensed phase thermochemistry data

Data compiled by: José A. Martinho Simões
Quantity | Value | Units | Method | Reference | Comment |
---|---|---|---|---|---|
ΔfH°solid | -103.5 ± 0.57 | kcal/mol | Review | Martinho Simões |

References

Leal and Martinho Simões, 1993
Leal, J.P.; Martinho Simões, J.A.,
J. Organometal. Chem., 1993, 460, 131. [all data]