U2F9 anion
- Formula: F9U2-
- Molecular weight: 647.04400

Gas phase thermochemistry data

Data compiled by: John E. Bartmess
Quantity | Value | Units | Method | Reference | Comment |
---|---|---|---|---|---|
ΔfH°gas | -4124. ± 30. | kJ/mol | TDEq | Pyatenko and Gorokhov, 1984 | value altered from reference due to conversion from electron convention to ion convention |
ΔfH°gas | -4132. ± 33. | kJ/mol | TDEq | Pyatenko, Gusarov, et al., 1980 | value altered from reference due to conversion from electron convention to ion convention |

Gas phase ion energetics data

Data compiled by: John E. Bartmess
Electron affinity of neutral species
EAneutral (eV) | Reference | Comment |
---|---|---|
4.30 ± 0.52 | Pyatenko and Gorokhov, 1984 | value altered from reference due to conversion from electron convention to ion convention |

References

Pyatenko and Gorokhov, 1984
Pyatenko, A.T.; Gorokhov, L.N.,
Electron Affinities of the U2Fn Molecules (8n12),
Chem. Phys. Lett., 1984, 105, 2, (1984)}, https://doi.org/10.1016/0009-2614(84)85651-1
. [all data]
Pyatenko, Gusarov, et al., 1980
Pyatenko, A.T.; Gusarov, A.V.; Gorokhov, L.N.,
Thermochemical Properties of Negative Ions in Vapor over UF4,
High Temp., 1980, 18, 857. [all data]