MeOH..mF-nitrobenzene radical anion
- Formula: C7H8FNO3-
- Molecular weight: 173.1423

Gas phase thermochemistry data

Data compiled by: John E. Bartmess
Quantity | Value | Units | Method | Reference | Comment |
---|---|---|---|---|---|
ΔfH°gas | -512. ± 13. | kJ/mol | Ther | Chowdhury, Grimsrud, et al., 1987 | Free energy affinity at 70°C. |

References

Chowdhury, Grimsrud, et al., 1987
Chowdhury, S.; Grimsrud, E.P.; Kebarle, P.,
Bonding of Charged Delocalized Anions to Protic and Dipolar Aprotic Solvent Molecules,
J. Phys. Chem., 1987, 91, 10, 2551, https://doi.org/10.1021/j100294a021
. [all data]