NH3..Br anion

Gas phase thermochemistry data

Data compiled by: John E. Bartmess

Quantity Value Units Method Reference Comment
Δfgas-290.5 ± 0.75kJ/molTherEvans, Keesee, et al., 1987

References

Evans, Keesee, et al., 1987
Evans, D.H.; Keesee, R.G.; Castleman Jr., The Association of Ammonia with Halide Ions in the Gas Phase, J. Chem. Phys., 1987, 86, 5, 2927, https://doi.org/10.1063/1.452043 . [all data]