LaCl3..LaCl4 anion
- Formula: Cl7La2-
- Molecular weight: 525.982

Gas phase thermochemistry data

Data compiled by: John E. Bartmess
Quantity | Value | Units | Method | Reference | Comment |
---|---|---|---|---|---|
ΔfH°gas | -2264. ± 37. | kJ/mol | Ther | Kudin, Vorob'ev, et al., 2007 | value altered from reference due to conversion from electron convention to ion convention |
ΔfH°gas | -2190. ± 30. | kJ/mol | Ther | Butman, Kudin, et al., 1987 | value altered from reference due to conversion from electron convention to ion convention |

Reaction thermochemistry data

Data compiled by: John E. Bartmess
Individual Reactions
By formula: Cl4La- + Cl3La = Cl7La2-
Quantity | Value | Units | Method | Reference | Comment |
---|---|---|---|---|---|
ΔrH° | 239. ± 41. | kJ/mol | TDEq | Kudin, Vorob'ev, et al., 2007 | gas phase; value altered from reference due to conversion from electron convention to ion convention |
ΔrH° | 194. ± 34. | kJ/mol | TDAs | Butman, Kudin, et al., 1987 | gas phase; value altered from reference due to conversion from electron convention to ion convention |

Ion clustering data

Data compiled by: John E. Bartmess
Clustering reactions
By formula: Cl4La- + Cl3La = Cl7La2-
Quantity | Value | Units | Method | Reference | Comment |
---|---|---|---|---|---|
ΔrH° | 239. ± 41. | kJ/mol | TDEq | Kudin, Vorob'ev, et al., 2007 | gas phase; value altered from reference due to conversion from electron convention to ion convention |
ΔrH° | 194. ± 34. | kJ/mol | TDAs | Butman, Kudin, et al., 1987 | gas phase; value altered from reference due to conversion from electron convention to ion convention |

References

Kudin, Vorob'ev, et al., 2007
Kudin, L.S.; Vorob'ev, D.E.; Grishin, A.E.,
The Thermochemical Characteristics of the LnCl4- and Ln2Cl7- Negative Ions,
Russ. J. Phys. Chem., 2007, 81, 2, 147, https://doi.org/10.1134/S003602440702001X
. [all data]
Butman, Kudin, et al., 1987
Butman, M.F.; Kudin, L.S.; Burdukovskaya, G.G.; Krasnov, K.S.; Bozhko, N.V.,
Mass Spectrometric Determination of the Enthalpy of Formation of the Gaseous Ions LaCl4- and La2Cl7-,
Russ. J. Phys. Chem., 1987, 61, 1518. [all data]