LaCl3..Cl anion
- Formula: Cl4La-
- Molecular weight: 280.718

Gas phase thermochemistry data

Data compiled by: John E. Bartmess
Quantity | Value | Units | Method | Reference | Comment |
---|---|---|---|---|---|
ΔfH°gas | -309.0 ± 4.1 | kcal/mol | Ther | Kudin, Vorob'ev, et al., 2007 | value altered from reference due to conversion from electron convention to ion convention |
ΔfH°gas | -299.9 ± 3.6 | kcal/mol | Ther | Butman, Kudin, et al., 1987 | value altered from reference due to conversion from electron convention to ion convention |

Reaction thermochemistry data

Data compiled by: John E. Bartmess
Individual Reactions
By formula: Cl4La- + Cl3La = Cl7La2-
Quantity | Value | Units | Method | Reference | Comment |
---|---|---|---|---|---|
ΔrH° | 57.1 ± 9.8 | kcal/mol | TDEq | Kudin, Vorob'ev, et al., 2007 | gas phase; value altered from reference due to conversion from electron convention to ion convention |
ΔrH° | 46.4 ± 8.2 | kcal/mol | TDAs | Butman, Kudin, et al., 1987 | gas phase; value altered from reference due to conversion from electron convention to ion convention |

Gas phase ion energetics data

Data compiled by: John E. Bartmess
Electron affinity of neutral species
EAneutral (eV) | Method | Reference | Comment |
---|---|---|---|
7.03 ± 0.10 | LPES | Yang, Wang, et al., 2008 | Vertical Detachment Energy: 7.83±0.06 eV |

Ion clustering data

Data compiled by: John E. Bartmess
Clustering reactions
By formula: Cl4La- + Cl3La = Cl7La2-
Quantity | Value | Units | Method | Reference | Comment |
---|---|---|---|---|---|
ΔrH° | 57.1 ± 9.8 | kcal/mol | TDEq | Kudin, Vorob'ev, et al., 2007 | gas phase; value altered from reference due to conversion from electron convention to ion convention |
ΔrH° | 46.4 ± 8.2 | kcal/mol | TDAs | Butman, Kudin, et al., 1987 | gas phase; value altered from reference due to conversion from electron convention to ion convention |

References

Kudin, Vorob'ev, et al., 2007
Kudin, L.S.; Vorob'ev, D.E.; Grishin, A.E.,
The Thermochemical Characteristics of the LnCl4- and Ln2Cl7- Negative Ions,
Russ. J. Phys. Chem., 2007, 81, 2, 147, https://doi.org/10.1134/S003602440702001X
. [all data]
Butman, Kudin, et al., 1987
Butman, M.F.; Kudin, L.S.; Burdukovskaya, G.G.; Krasnov, K.S.; Bozhko, N.V.,
Mass Spectrometric Determination of the Enthalpy of Formation of the Gaseous Ions LaCl4- and La2Cl7-,
Russ. J. Phys. Chem., 1987, 61, 1518. [all data]
Yang, Wang, et al., 2008
Yang, J.; Wang, X.-B.; Xing, X.-P.; Wang, L.-S.,
Photoelectron spectroscopy of anions at 118.2 nm: Observation of high electron binding energies in superhalogens MCl4- (M = Sc, Y, La),
J. Chem. Phys., 2008, 128, 20, 201102, https://doi.org/10.1063/1.2938390
. [all data]