azulenide anion
- Formula: C10H7-
- Molecular weight: 127.1631

Gas phase ion energetics data

Data compiled by: John E. Bartmess
Protonation reactions
By formula: C10H7- + H+ = C10H8
Quantity | Value | Units | Method | Reference | Comment |
---|---|---|---|---|---|
ΔrH° | 367.7 ± 2.5 | kcal/mol | TDEq | Meot-ner, Liebman, et al., 1988 | gas phase; Acidity seriously disagrees with high level calculations. Dissociative to acetylide? C-3is most acidic site by G3MP2B3 calns. |
Quantity | Value | Units | Method | Reference | Comment |
ΔrG° | 360.2 ± 2.0 | kcal/mol | TDEq | Meot-ner, Liebman, et al., 1988 | gas phase; Acidity seriously disagrees with high level calculations. Dissociative to acetylide? C-3is most acidic site by G3MP2B3 calns. |

Reaction thermochemistry data

Data compiled by: John E. Bartmess

Individual Reactions

C10H7- + Hydrogen cation = Azulene

By formula: C10H7- + H+ = C10H8

Quantity Value Units Method Reference Comment
Δr367.7 ± 2.5kcal/molTDEqMeot-ner, Liebman, et al., 1988gas phase; Acidity seriously disagrees with high level calculations. Dissociative to acetylide? C-3is most acidic site by G3MP2B3 calns.
Quantity Value Units Method Reference Comment
Δr360.2 ± 2.0kcal/molTDEqMeot-ner, Liebman, et al., 1988gas phase; Acidity seriously disagrees with high level calculations. Dissociative to acetylide? C-3is most acidic site by G3MP2B3 calns.

References

Meot-ner, Liebman, et al., 1988
Meot-ner, M.; Liebman, J.F.; Kafafi, S.A.,
Ionic Probes of Aromaticity in Annelated Rings,
J. Am. Chem. Soc., 1988, 110, 18, 5937, https://doi.org/10.1021/ja00226a001
. [all data]