styrenide anion
- Formula: C8H7-
- Molecular weight: 103.1417
- IUPAC Standard InChIKey: ZPMIYYULEXERFQ-UHFFFAOYSA-N
- Chemical structure:
View 3d structure (requires JavaScript / HTML 5) - Permanent link for this species. Use this link for bookmarking this species for future reference.

Reaction thermochemistry data

Data compiled by: John E. Bartmess
Individual Reactions
Quantity | Value | Units | Method | Reference | Comment |
---|---|---|---|---|---|
ΔrH° | 1636. ± 10. | kJ/mol | TDEq | Meot-ner and Kafafi, 1988 | gas phase; Acid: styrene. AM1 says ortho deprotonation prefered to alpha. Anchored to 88MEO scale. |
Quantity | Value | Units | Method | Reference | Comment |
ΔrG° | 1604. ± 8.4 | kJ/mol | TDEq | Meot-ner and Kafafi, 1988 | gas phase; Acid: styrene. AM1 says ortho deprotonation prefered to alpha. Anchored to 88MEO scale. |

Gas phase ion energetics data

Data compiled by: John E. Bartmess
Protonation reactions
Quantity | Value | Units | Method | Reference | Comment |
---|---|---|---|---|---|
ΔrH° | 1636. ± 10. | kJ/mol | TDEq | Meot-ner and Kafafi, 1988 | gas phase; Acid: styrene. AM1 says ortho deprotonation prefered to alpha. Anchored to 88MEO scale. |
Quantity | Value | Units | Method | Reference | Comment |
ΔrG° | 1604. ± 8.4 | kJ/mol | TDEq | Meot-ner and Kafafi, 1988 | gas phase; Acid: styrene. AM1 says ortho deprotonation prefered to alpha. Anchored to 88MEO scale. |

References

Meot-ner and Kafafi, 1988
Meot-ner, M.; Kafafi, S.A.,
Carbon Acidities of Aromatic Compounds,
J. Am. Chem. Soc., 1988, 110, 19, 6297, https://doi.org/10.1021/ja00227a003
. [all data]