HMoO4 anion
- Formula: HMoO4-
- Molecular weight: 160.97

Gas phase ion energetics data

Data compiled by: John E. Bartmess
Protonation reactions
By formula: HMoO4- + H+ = H2MoO4
Quantity | Value | Units | Method | Reference | Comment |
---|---|---|---|---|---|
ΔrH° | 1362. ± 40. | kJ/mol | TDEq | Miller, 1979 | gas phase; e- + H2MoO4 <=> HMoO4- + H |

References

Miller, 1979
Miller, W.J.,
The use of flames as media for the study of in-molecule thermochemistry in characterization of high temperature vapors and gases,
NBS Spec. Publ. U.S., 1979, 561, 443. [all data]