Ni(CO)3 anion
- Formula: C3NiO3-
- Molecular weight: 142.7242

Gas phase thermochemistry data

Data compiled by: John E. Bartmess
Quantity | Value | Units | Method | Reference | Comment |
---|---|---|---|---|---|
ΔfH°gas | -119.3 ± 1.1 | kcal/mol | R-EA | Stevens, Feigerle, et al., 1982 |

Ion clustering data

Data compiled by: John E. Bartmess
Clustering reactions
C3NiO3- + = C3BrNiO3-
By formula: C3NiO3- + Br = C3BrNiO3-
Quantity | Value | Units | Method | Reference | Comment |
---|---|---|---|---|---|
ΔrH° | >70.90 | kcal/mol | IMRB | Jones, McDonald, et al., 1989 | gas phase |
C3NiO3- + = C3ClNiO3-
By formula: C3NiO3- + Cl = C3ClNiO3-
Quantity | Value | Units | Method | Reference | Comment |
---|---|---|---|---|---|
ΔrH° | >79.20 | kcal/mol | IMRB | Jones, McDonald, et al., 1989 | gas phase |
C3NiO3- + = C3INiO3-
By formula: C3NiO3- + I = C3INiO3-
Quantity | Value | Units | Method | Reference | Comment |
---|---|---|---|---|---|
ΔrH° | >55.00 | kcal/mol | IMRB | Jones, McDonald, et al., 1989 | gas phase |

Reaction thermochemistry data

Data compiled by: John E. Bartmess

Individual Reactions

C3NiO3- + Bromine = C3BrNiO3-

By formula: C3NiO3- + Br = C3BrNiO3-

Quantity Value Units Method Reference Comment
Δr>296.6kJ/molIMRBJones, McDonald, et al., 1989gas phase

C3NiO3- + Iodine atom = C3INiO3-

By formula: C3NiO3- + I = C3INiO3-

Quantity Value Units Method Reference Comment
Δr>230.1kJ/molIMRBJones, McDonald, et al., 1989gas phase

C3NiO3- + Chlorine atom = C3ClNiO3-

By formula: C3NiO3- + Cl = C3ClNiO3-

Quantity Value Units Method Reference Comment
Δr>331.4kJ/molIMRBJones, McDonald, et al., 1989gas phase

References

Stevens, Feigerle, et al., 1982
Stevens, A.E.; Feigerle, C.S.; Lineberger, W.C.,
Laser Photoelectron Spectrometry of Ni(CO)n-, n=1-3,
J. Am. Chem. Soc., 1982, 104, 19, 5026, https://doi.org/10.1021/ja00383a004
. [all data]
Jones, McDonald, et al., 1989
Jones, M.T.; McDonald, R.N.; Schell, P.L.; Ali, M.H.,
Kinetics and Mechanism of Halogen Atom Transfer Reactions between Haloalkanes and Several 17-Electron Transition Metal Complex Negative Ions in the Gas Phase,
J. Am. Chem. Soc., 1989, 111, 16, 5983, https://doi.org/10.1021/ja00198a001
. [all data]