p-pyridinyl-CH2 anion
- Formula: C6H6N-
- Molecular weight: 92.1191

Gas phase ion energetics data

Data compiled by: John E. Bartmess
Protonation reactions
By formula: C6H6N- + H+ = C6H7N
Quantity | Value | Units | Method | Reference | Comment |
---|---|---|---|---|---|
ΔrH° | 1547. ± 21. | kJ/mol | G+TS | Meot-ner and Kafafi, 1988 | gas phase; anchored to 88MEO scale, not the "87 acidity scale". The Kiefer, Zhang, et al., 1997 BDE is for ortho. |
ΔrH° | 1568. ± 13. | kJ/mol | G+TS | DePuy, Kass, et al., 1988 | gas phase; Acid: p-methylpyridine. Between iPrOH, MeCN. |
Quantity | Value | Units | Method | Reference | Comment |
ΔrG° | 1518. ± 21. | kJ/mol | IMRB | Meot-ner and Kafafi, 1988 | gas phase; anchored to 88MEO scale, not the "87 acidity scale". The Kiefer, Zhang, et al., 1997 BDE is for ortho. |
ΔrG° | 1540. ± 13. | kJ/mol | IMRB | DePuy, Kass, et al., 1988 | gas phase; Acid: p-methylpyridine. Between iPrOH, MeCN. |

Reaction thermochemistry data

Data compiled by: John E. Bartmess

Individual Reactions

C6H6N- + Hydrogen cation = Pyridine, 4-methyl-

By formula: C6H6N- + H+ = C6H7N

Quantity Value Units Method Reference Comment
Δr369.7 ± 5.1kcal/molG+TSMeot-ner and Kafafi, 1988gas phase; anchored to 88MEO scale, not the "87 acidity scale". The Kiefer, Zhang, et al., 1997 BDE is for ortho.
Δr374.8 ± 3.1kcal/molG+TSDePuy, Kass, et al., 1988gas phase; Acid: p-methylpyridine. Between iPrOH, MeCN.
Quantity Value Units Method Reference Comment
Δr362.9 ± 5.0kcal/molIMRBMeot-ner and Kafafi, 1988gas phase; anchored to 88MEO scale, not the "87 acidity scale". The Kiefer, Zhang, et al., 1997 BDE is for ortho.
Δr368.0 ± 3.0kcal/molIMRBDePuy, Kass, et al., 1988gas phase; Acid: p-methylpyridine. Between iPrOH, MeCN.

References

Meot-ner and Kafafi, 1988
Meot-ner, M.; Kafafi, S.A.,
Carbon Acidities of Aromatic Compounds,
J. Am. Chem. Soc., 1988, 110, 19, 6297, https://doi.org/10.1021/ja00227a003
. [all data]
Kiefer, Zhang, et al., 1997
Kiefer, J.H.; Zhang, Q.; Kern, R.D.; Yao, J.; Jursic, B.,
Pyrolysis of Aromatic Azines: Pyrazine, Pyrimidine, and Pyridine,
J. Phys. Chem. A, 1997, 101, 38, 7061, https://doi.org/10.1021/jp970211z
. [all data]
DePuy, Kass, et al., 1988
DePuy, C.H.; Kass, S.R.; Bean, G.P.,
Formation and Reactions of Heteroaromatic Anions in the Gas Phase,
J. Org. Chem., 1988, 53, 19, 4427, https://doi.org/10.1021/jo00254a001
. [all data]