m-pyridinyl-CH2 anion
- Formula: C6H6N-
- Molecular weight: 92.1191

Reaction thermochemistry data

Data compiled by: John E. Bartmess
Individual Reactions
By formula: C6H6N- + H+ = C6H7N
Quantity | Value | Units | Method | Reference | Comment |
---|---|---|---|---|---|
ΔrH° | 377.8 ± 3.1 | kcal/mol | G+TS | DePuy, Kass, et al., 1988 | gas phase; Acid: 3-methylpyridine. Comparable to EtOH. |
Quantity | Value | Units | Method | Reference | Comment |
ΔrG° | 371.0 ± 3.0 | kcal/mol | IMRB | DePuy, Kass, et al., 1988 | gas phase; Acid: 3-methylpyridine. Comparable to EtOH. |

Gas phase ion energetics data

Data compiled by: John E. Bartmess
Protonation reactions
By formula: C6H6N- + H+ = C6H7N
Quantity | Value | Units | Method | Reference | Comment |
---|---|---|---|---|---|
ΔrH° | 377.8 ± 3.1 | kcal/mol | G+TS | DePuy, Kass, et al., 1988 | gas phase; Acid: 3-methylpyridine. Comparable to EtOH. |
Quantity | Value | Units | Method | Reference | Comment |
ΔrG° | 371.0 ± 3.0 | kcal/mol | IMRB | DePuy, Kass, et al., 1988 | gas phase; Acid: 3-methylpyridine. Comparable to EtOH. |

References

DePuy, Kass, et al., 1988
DePuy, C.H.; Kass, S.R.; Bean, G.P.,
Formation and Reactions of Heteroaromatic Anions in the Gas Phase,
J. Org. Chem., 1988, 53, 19, 4427, https://doi.org/10.1021/jo00254a001
. [all data]