N2..{O2}..O2 radical anion
- Formula: N2O4-
- Molecular weight: 92.0115

Reaction thermochemistry data

Data compiled by: John E. Bartmess
Individual Reactions
O4- + +
= N2O4-
By formula: O4- + N2 + O2 = N2O4-
Quantity | Value | Units | Method | Reference | Comment |
---|---|---|---|---|---|
ΔrH° | 12.1 ± 0.84 | kJ/mol | TDAs | Hiraoka, 1988 | gas phase |
Quantity | Value | Units | Method | Reference | Comment |
ΔrG° | -8.8 ± 2.1 | kJ/mol | TDAs | Hiraoka, 1988 | gas phase |

Ion clustering data

Data compiled by: John E. Bartmess

Clustering reactions

O4- + Nitrogen + Oxygen = N2O4-

By formula: O4- + N2 + O2 = N2O4-

Quantity Value Units Method Reference Comment
Δr2.90 ± 0.20kcal/molTDAsHiraoka, 1988gas phase
Quantity Value Units Method Reference Comment
Δr-2.10 ± 0.50kcal/molTDAsHiraoka, 1988gas phase

References

Hiraoka, 1988
Hiraoka, K.,
Determination of the Stabilities of O3-(N2)n, O3-(O2)n, and O4-(N2)n from Measurements of the Gas Phase Equilibria,
Chem. Phys., 1988, 125, 2-3, 439, https://doi.org/10.1016/0301-0104(88)87096-4
. [all data]