MoOF3..F anion
- Formula: F4MoO-
- Molecular weight: 187.95

Gas phase thermochemistry data

Data compiled by: John E. Bartmess
Quantity | Value | Units | Method | Reference | Comment |
---|---|---|---|---|---|
ΔfH°gas | -1674.9 | kJ/mol | Ther | Borchevsky and Sidorov, 1985 | Fluoride Affinity: MoOF3 < MoF5 by 4.0±2.0 kcal/mol; value altered from reference due to conversion from electron convention to ion convention |

Gas phase ion energetics data

Data compiled by: John E. Bartmess
Electron affinity of neutral species
EAneutral (eV) | Method | Reference | Comment |
---|---|---|---|
3.84206 | R-A | Borchevsky and Sidorov, 1985 | Fluoride Affinity: MoOF3 < MoF5 by 4.0±2.0 kcal/mol; value altered from reference due to conversion from electron convention to ion convention |

References

Borchevsky and Sidorov, 1985
Borchevsky, A.Ya.; Sidorov, L.N.,
Ion-Molecule, Ion-Ion, and Molecule-Molecule Equilibria in the System Mo-U-Fe-F-O-e-,
Dokl. Akad. Nauk SSSR Ser. Khim., 1985, 285, 377. [all data]