MoF4..F anion
- Formula: F5Mo-
- Molecular weight: 190.95

Gas phase thermochemistry data

Data compiled by: John E. Bartmess
Quantity | Value | Units | Method | Reference | Comment |
---|---|---|---|---|---|
ΔfH°gas | -375.7 ± 5.5 | kcal/mol | Ther | Borshchevskii, Boltalina, et al., 1988 | value altered from reference due to conversion from electron convention to ion convention |

Gas phase ion energetics data

Data compiled by: John E. Bartmess
Electron affinity of neutral species
EAneutral (eV) | Method | Reference | Comment |
---|---|---|---|
3.46 ± 0.18 | R-A | Borshchevskii, Boltalina, et al., 1988 | value altered from reference due to conversion from electron convention to ion convention |
3.47997 | R-A | Borchevsky and Sidorov, 1985 | Fluoride Affinity: MoF4 > UF4 by 7.1 kcal/mol; value altered from reference due to conversion from electron convention to ion convention |
>3.49948 | NBAE | Compton, Reinhardt, et al., 1978 | From MoF6 |
>3.30 ± 0.40 | NBAE | Mathur, Rothe, et al., 1977 | From MoF6 |

References

Borshchevskii, Boltalina, et al., 1988
Borshchevskii, A.Ya.; Boltalina, O.V.; Sorokin, I.D.; Sidorov, L.N.,
Thermochemical Quantities for Gas Phase Iron, Uranium, and Molybdenum Fluorides, and Their Negative Ions.,
J. Chem. Thermodyn., 1988, 20, 5, 523, https://doi.org/10.1016/0021-9614(88)90080-8
. [all data]
Borchevsky and Sidorov, 1985
Borchevsky, A.Ya.; Sidorov, L.N.,
Ion-Molecule, Ion-Ion, and Molecule-Molecule Equilibria in the System Mo-U-Fe-F-O-e-,
Dokl. Akad. Nauk SSSR Ser. Khim., 1985, 285, 377. [all data]
Compton, Reinhardt, et al., 1978
Compton, R.N.; Reinhardt, P.W.; Cooper, C.D.,
Collisional ionization between fast alkali atoms and selected hexafluoride molecules,
J. Chem. Phys., 1978, 68, 2023. [all data]
Mathur, Rothe, et al., 1977
Mathur, B.P.; Rothe, R.W.; Reck, G.P.,
Ionization reactions of metal hexafluorides with alkali atoms and dimers,
J. Chem. Phys., 1977, 67, 377. [all data]