DyI3..DyI4 anion
- Formula: Dy2I7-
- Molecular weight: 1213.332

Gas phase thermochemistry data

Data compiled by: John E. Bartmess
Quantity | Value | Units | Method | Reference | Comment |
---|---|---|---|---|---|
ΔfH°gas | -1265. ± 12. | kJ/mol | Ther | Lelik, Korobov, et al., 1984 | reworked from reference due to better dHf(DyI3); value altered from reference due to conversion from electron convention to ion convention |

Reaction thermochemistry data

Data compiled by: John E. Bartmess
Individual Reactions
By formula: DyI4- + DyI3 = Dy2I7-
Quantity | Value | Units | Method | Reference | Comment |
---|---|---|---|---|---|
ΔrH° | 189.1 ± 2.5 | kJ/mol | TDAs | Lelik, Korobov, et al., 1984 | gas phase; reworked from reference due to better dHf(DyI3); value altered from reference due to conversion from electron convention to ion convention |

Ion clustering data

Data compiled by: John E. Bartmess

Clustering reactions

DyI4- + DyI3 = Dy2I7-

By formula: DyI4- + DyI3 = Dy2I7-

Quantity Value Units Method Reference Comment
Δr189.1 ± 2.5kJ/molTDAsLelik, Korobov, et al., 1984gas phase; reworked from reference due to better dHf(DyI3); value altered from reference due to conversion from electron convention to ion convention

References

Lelik, Korobov, et al., 1984
Lelik, L.; Korobov, M.V.; Kaposi, O.; Sidorov, L.N.,
Negative Ions in the Gas Phase of Dysprosium Triiodide and of the CsI-DyI3 and CsI-NaI-DyI3 Systems,
Russ. J. Phys. Chem., 1984, 58, 1164. [all data]