DyI3..I anion
- Formula: DyI4-
- Molecular weight: 670.118

Gas phase thermochemistry data

Data compiled by: John E. Bartmess
Quantity | Value | Units | Method | Reference | Comment |
---|---|---|---|---|---|
ΔfH°gas | -765.7 ± 9.2 | kJ/mol | Ther | Lelik, Korobov, et al., 1984 | anion heat reworked from reference due to better dHf(DyI3); value altered from reference due to conversion from electron convention to ion convention |

Reaction thermochemistry data

Data compiled by: John E. Bartmess
Individual Reactions
By formula: DyI4- + DyI3 = Dy2I7-
Quantity | Value | Units | Method | Reference | Comment |
---|---|---|---|---|---|
ΔrH° | 189.1 ± 2.5 | kJ/mol | TDAs | Lelik, Korobov, et al., 1984 | gas phase; reworked from reference due to better dHf(DyI3); value altered from reference due to conversion from electron convention to ion convention |

Ion clustering data

Data compiled by: John E. Bartmess
Clustering reactions
By formula: DyI4- + DyI3 = Dy2I7-
Quantity | Value | Units | Method | Reference | Comment |
---|---|---|---|---|---|
ΔrH° | 45.20 ± 0.60 | kcal/mol | TDAs | Lelik, Korobov, et al., 1984 | gas phase; reworked from reference due to better dHf(DyI3); value altered from reference due to conversion from electron convention to ion convention |

References

Lelik, Korobov, et al., 1984
Lelik, L.; Korobov, M.V.; Kaposi, O.; Sidorov, L.N.,
Negative Ions in the Gas Phase of Dysprosium Triiodide and of the CsI-DyI3 and CsI-NaI-DyI3 Systems,
Russ. J. Phys. Chem., 1984, 58, 1164. [all data]