CoF3..F anion
- Formula: CoF4-
- Molecular weight: 134.927356

Gas phase thermochemistry data

Data compiled by: John E. Bartmess
Quantity | Value | Units | Method | Reference | Comment |
---|---|---|---|---|---|
ΔfH°gas | -302. ± 14. | kcal/mol | Ther | Rau, Chilingarov, et al., 1997 | Values are at 0K; value altered from reference due to conversion from electron convention to ion convention |

Gas phase ion energetics data

Data compiled by: John E. Bartmess
Electron affinity of neutral species
EAneutral (eV) | Method | Reference | Comment |
---|---|---|---|
6.40 ± 0.30 | R-A | Rau, Chilingarov, et al., 1997 | Values are at 0K; value altered from reference due to conversion from electron convention to ion convention |

References

Rau, Chilingarov, et al., 1997
Rau, J.V.; Chilingarov, N.S.; Sidorov, L.N.,
Mass spectrometric determination of cobalt trifluoride saturated vapor pressure. Enthalpy of formation of gaseous CoF4, and CoF4-,
Rapid Commun. Mass Spectrom., 1997, 11, 18, 1977-1979, https://doi.org/10.1002/(SICI)1097-0231(199712)11:18<1977::AID-RCM808>3.0.CO;2-J
. [all data]