CH2=C(Me)CO anion
- Formula: C4H5O-
- Molecular weight: 69.0824

Reaction thermochemistry data

Data compiled by: John E. Bartmess
Individual Reactions
By formula: C4H5O- + H+ = C4H6O
Quantity | Value | Units | Method | Reference | Comment |
---|---|---|---|---|---|
ΔrH° | 1576. ± 13. | kJ/mol | G+TS | Kleingeld and Nibbering, 1984 | gas phase; Acid: 2-methylpropenal. Reprotonation to dimethyl ketene? G3MP2B3 calculations indicate a dHacid of 396 kcal/mol |
Quantity | Value | Units | Method | Reference | Comment |
ΔrG° | 1544. ± 13. | kJ/mol | IMRB | Kleingeld and Nibbering, 1984 | gas phase; Acid: 2-methylpropenal. Reprotonation to dimethyl ketene? G3MP2B3 calculations indicate a dHacid of 396 kcal/mol |

Gas phase ion energetics data

Data compiled by: John E. Bartmess
Protonation reactions
By formula: C4H5O- + H+ = C4H6O
Quantity | Value | Units | Method | Reference | Comment |
---|---|---|---|---|---|
ΔrH° | 1576. ± 13. | kJ/mol | G+TS | Kleingeld and Nibbering, 1984 | gas phase; Acid: 2-methylpropenal. Reprotonation to dimethyl ketene? G3MP2B3 calculations indicate a dHacid of 396 kcal/mol |
Quantity | Value | Units | Method | Reference | Comment |
ΔrG° | 1544. ± 13. | kJ/mol | IMRB | Kleingeld and Nibbering, 1984 | gas phase; Acid: 2-methylpropenal. Reprotonation to dimethyl ketene? G3MP2B3 calculations indicate a dHacid of 396 kcal/mol |

References

Kleingeld and Nibbering, 1984
Kleingeld, J.C.; Nibbering, N.M.M.,
Negative Ion/Molecule Cycloaddition Reactions of 2-Methylpropenal in the Gas Phase,
Recl. Trav. Chim. Pays-Bas, 1984, 103, 3, 87, https://doi.org/10.1002/recl.19841030303
. [all data]