2,2-diMe-cyclopropoxide anion
- Formula: C5H9O-
- Molecular weight: 85.1249

Reaction thermochemistry data

Data compiled by: John E. Bartmess
Individual Reactions
C5H9O- + = C5H10O
By formula: C5H9O- + H+ = C5H10O
Quantity | Value | Units | Method | Reference | Comment |
---|---|---|---|---|---|
ΔrH° | 1504. ± 17. | kJ/mol | G+TS | Peerboom, Ingemann, et al., 1985 | gas phase; likely anion mixture of open and cyclized |
Quantity | Value | Units | Method | Reference | Comment |
ΔrG° | 1474. ± 17. | kJ/mol | IMRB | Peerboom, Ingemann, et al., 1985 | gas phase; likely anion mixture of open and cyclized |

Gas phase ion energetics data

Data compiled by: John E. Bartmess
Protonation reactions
C5H9O- + = C5H10O
By formula: C5H9O- + H+ = C5H10O
Quantity | Value | Units | Method | Reference | Comment |
---|---|---|---|---|---|
ΔrH° | 1504. ± 17. | kJ/mol | G+TS | Peerboom, Ingemann, et al., 1985 | gas phase; likely anion mixture of open and cyclized |
Quantity | Value | Units | Method | Reference | Comment |
ΔrG° | 1474. ± 17. | kJ/mol | IMRB | Peerboom, Ingemann, et al., 1985 | gas phase; likely anion mixture of open and cyclized |

References

Peerboom, Ingemann, et al., 1985
Peerboom, R.; Ingemann, S.; Nibbering, N.M.M.,
Isomeric C5H9O- Ions Formed in the Gas-Phase Reactions of Anions with 2,2-Dimethylpropanal and 2,2-Dimethylcyclopropanol,
Recl. Trav. Chim. Pays-Bas, 1985, 104, 3, 74, https://doi.org/10.1002/recl.19851040305
. [all data]