C3CrO3-

Reaction thermochemistry data

Data compiled by: John E. Bartmess

Individual Reactions

C3CrO3- + Carbon monoxide = (C3CrO3- • Carbon monoxide)

By formula: C3CrO3- + CO = (C3CrO3- • CO)

Quantity Value Units Method Reference Comment
Δr166. ± 16.kJ/molCIDTSunderlin, Wang, et al., 1993gas phase

Ion clustering data

Data compiled by: John E. Bartmess

Clustering reactions

C3CrO3- + Carbon monoxide = (C3CrO3- • Carbon monoxide)

By formula: C3CrO3- + CO = (C3CrO3- • CO)

Quantity Value Units Method Reference Comment
Δr166. ± 16.kJ/molCIDTSunderlin, Wang, et al., 1993gas phase

References

Sunderlin, Wang, et al., 1993
Sunderlin, L.S.; Wang, D.N.; Squires, R.R., Bond Strengths in 1st-Row-Metal Carbonyl Anions, J. Am. Chem. Soc., 1993, 115, 25, 12060, https://doi.org/10.1021/ja00078a051 . [all data]