GaF3..GaF4 anion
- Formula: F7Ga2-
- Molecular weight: 272.435

Reaction thermochemistry data

Data compiled by: John E. Bartmess
Individual Reactions
By formula: F4Ga- + F3Ga = F7Ga2-
Quantity | Value | Units | Method | Reference | Comment |
---|---|---|---|---|---|
ΔrH° | 217. ± 20. | kJ/mol | TDEq | Zhuravleva, Nikitin, et al., 1985 | gas phase; value altered from reference due to conversion from electron convention to ion convention |

Ion clustering data

Data compiled by: John E. Bartmess
Clustering reactions
By formula: F4Ga- + F3Ga = F7Ga2-
Quantity | Value | Units | Method | Reference | Comment |
---|---|---|---|---|---|
ΔrH° | 217. ± 20. | kJ/mol | TDEq | Zhuravleva, Nikitin, et al., 1985 | gas phase; value altered from reference due to conversion from electron convention to ion convention |

Gas phase thermochemistry data

Data compiled by: John E. Bartmess
Quantity | Value | Units | Method | Reference | Comment |
---|---|---|---|---|---|
ΔfH°gas | -2770. ± 46. | kJ/mol | Ther | Zhuravleva, Nikitin, et al., 1985 | value altered from reference due to conversion from electron convention to ion convention |

References

Zhuravleva, Nikitin, et al., 1985
Zhuravleva, L.V.; Nikitin, M.I.; Sorokin, I.D.; Sidorov, L.N.,
Mass Spectrometric Determination of the Enthalpies of Dissociation of Gaseous Complex Fluorides into Neutral and Charged Particles. VIII. MF-..GaF3 Systems (M=Li, Na, K, Rb, Cs),
Int. J. Mass Spectrom. Ion Proc., 1985, 65, 3, 253, https://doi.org/10.1016/0168-1176(85)87002-6
. [all data]