MeNO2..NO2 anion
- Formula: CH3N2O4-
- Molecular weight: 107.0461

Gas phase thermochemistry data

Data compiled by: John E. Bartmess
Quantity | Value | Units | Method | Reference | Comment |
---|---|---|---|---|---|
ΔfH°gas | -76.48 ± 0.54 | kcal/mol | Ther | Wincel, 2003 |

Reaction thermochemistry data

Data compiled by: John E. Bartmess

Individual Reactions

CH3N2O4- + 2Methane, nitro- = C2H6N3O6-

By formula: CH3N2O4- + 2CH3NO2 = C2H6N3O6-

Quantity Value Units Method Reference Comment
Δr12.40 ± 0.50kcal/molN/AWincel, 2003gas phase
Quantity Value Units Method Reference Comment
Δr5.40kcal/molTDAsWincel, 2003gas phase

Ion clustering data

Data compiled by: John E. Bartmess

Clustering reactions

CH3N2O4- + 2Methane, nitro- = C2H6N3O6-

By formula: CH3N2O4- + 2CH3NO2 = C2H6N3O6-

Quantity Value Units Method Reference Comment
Δr12.40 ± 0.50kcal/molN/AWincel, 2003gas phase
Quantity Value Units Method Reference Comment
Δr5.40kcal/molTDAsWincel, 2003gas phase

References

Wincel, 2003
Wincel, H.,
Gas-phase Solvation of Cl-, NO2-, CH2NO2-, CH3NO2-, and CH3NO4- by CH3NO2,
Int. J. Mass Spectrom., 2003, 226, 3, 341-353, https://doi.org/10.1016/S1387-3806(03)00066-6
. [all data]