calcium anion
- Formula: Ca-
- Molecular weight: 40.079

Gas phase thermochemistry data

Data compiled by: John E. Bartmess
Quantity | Value | Units | Method | Reference | Comment |
---|---|---|---|---|---|
ΔfH°gas | 41.93 ± 0.80 | kcal/mol | R-EA | Petrunin, Andersen, et al., 1996 |

Gas phase ion energetics data

Data compiled by: John E. Bartmess
Protonation reactions
Quantity | Value | Units | Method | Reference | Comment |
---|---|---|---|---|---|
ΔrH° | 352.80 ± 0.93 | kcal/mol | D-EA | Petrunin, Andersen, et al., 1996 | gas phase |
Quantity | Value | Units | Method | Reference | Comment |
ΔrG° | 347.0 ± 1.0 | kcal/mol | H-TS | Petrunin, Andersen, et al., 1996 | gas phase |

Reaction thermochemistry data

Data compiled by: John E. Bartmess

Individual Reactions

Ca- + Hydrogen cation = Calcium monohydride

By formula: Ca- + H+ = HCa

Quantity Value Units Method Reference Comment
Δr1476.1 ± 3.9kJ/molD-EAPetrunin, Andersen, et al., 1996gas phase
Quantity Value Units Method Reference Comment
Δr1452. ± 4.2kJ/molH-TSPetrunin, Andersen, et al., 1996gas phase

References

Petrunin, Andersen, et al., 1996
Petrunin, V.V.; Andersen, H.H.; Balling, P.; Andersen, T.,
Structural Properties of the Negative Calcium Ion: Binding Energies and Fine-structure Splitting,
Phys. Rev. Lett., 1996, 76, 5, 744, https://doi.org/10.1103/PhysRevLett.76.744
. [all data]