Cr(CO)5 anion
- Formula: C5CrO5-
- Molecular weight: 192.0471

Gas phase thermochemistry data

Data compiled by: John E. Bartmess
Quantity | Value | Units | Method | Reference | Comment |
---|---|---|---|---|---|
ΔfH°gas | <-861.90 | kJ/mol | R-EA | Sallans, Lane, et al., 1985 |

Ion clustering data

Data compiled by: John E. Bartmess
Clustering reactions
C5CrO5- + = C5BrCrO5-
By formula: C5CrO5- + Br = C5BrCrO5-
Quantity | Value | Units | Method | Reference | Comment |
---|---|---|---|---|---|
ΔrH° | >295.4 | kJ/mol | IMRB | Jones, McDonald, et al., 1989 | gas phase |
C5CrO5- + = C5ClCrO5-
By formula: C5CrO5- + Cl = C5ClCrO5-
Quantity | Value | Units | Method | Reference | Comment |
---|---|---|---|---|---|
ΔrH° | >331.4 | kJ/mol | IMRB | Jones, McDonald, et al., 1989 | gas phase |
C5CrO5- + = C5CrIO5-
By formula: C5CrO5- + I = C5CrIO5-
Quantity | Value | Units | Method | Reference | Comment |
---|---|---|---|---|---|
ΔrH° | >239.3 | kJ/mol | IMRB | Jones, McDonald, et al., 1989 | gas phase |

Reaction thermochemistry data

Data compiled by: John E. Bartmess
Individual Reactions
C5CrO5- + = C5BrCrO5-
By formula: C5CrO5- + Br = C5BrCrO5-
Quantity | Value | Units | Method | Reference | Comment |
---|---|---|---|---|---|
ΔrH° | >70.60 | kcal/mol | IMRB | Jones, McDonald, et al., 1989 | gas phase |
C5CrO5- + = C5CrIO5-
By formula: C5CrO5- + I = C5CrIO5-
Quantity | Value | Units | Method | Reference | Comment |
---|---|---|---|---|---|
ΔrH° | >57.20 | kcal/mol | IMRB | Jones, McDonald, et al., 1989 | gas phase |
C5CrO5- + = C5ClCrO5-
By formula: C5CrO5- + Cl = C5ClCrO5-
Quantity | Value | Units | Method | Reference | Comment |
---|---|---|---|---|---|
ΔrH° | >79.20 | kcal/mol | IMRB | Jones, McDonald, et al., 1989 | gas phase |

References

Sallans, Lane, et al., 1985
Sallans, L.; Lane, K.R.; Squires, R.R.; Freiser, B.S.,
Generation and reactions of atomic metal anions in the gas phase. Determination of the heterolytic and homolytic bond energies of VH, VrH, FeH, CoH, and MoH,
J. Am. Chem. Soc., 1985, 107, 4379. [all data]
Jones, McDonald, et al., 1989
Jones, M.T.; McDonald, R.N.; Schell, P.L.; Ali, M.H.,
Kinetics and Mechanism of Halogen Atom Transfer Reactions between Haloalkanes and Several 17-Electron Transition Metal Complex Negative Ions in the Gas Phase,
J. Am. Chem. Soc., 1989, 111, 16, 5983, https://doi.org/10.1021/ja00198a001
. [all data]