Ge2F6 radical anion
- Formula: F6Ge2-
- Molecular weight: 259.27

Gas phase thermochemistry data

Data compiled by: John E. Bartmess
Quantity | Value | Units | Method | Reference | Comment |
---|---|---|---|---|---|
ΔfH°gas | <-642. ± 14. | kcal/mol | IMRB | Harland, Cradock, et al., 1972 | GeF3- + GeF4 ->. G2(MP2) cal'n say this is too stable by 164 kcal/mol. Authors assume EA(GeF4)=3 eV; G2(MP2) says 1.2 eV |

References

Harland, Cradock, et al., 1972
Harland, P.W.; Cradock, S.; Thynne, J.C.J.,
Positive- and negative-ion formation due to the electron bombardment of germanium tetrafluoride,
Int. J. Mass Spectrom. Ion Phys., 1972, 10, 169. [all data]