Ge2F4 radical anion
- Formula: F4Ge2-
- Molecular weight: 221.27

Gas phase thermochemistry data

Data compiled by: John E. Bartmess
Quantity | Value | Units | Method | Reference | Comment |
---|---|---|---|---|---|
ΔfH°gas | <-668.80 | kcal/mol | IMRB | Harland, Cradock, et al., 1972 |

References

Harland, Cradock, et al., 1972
Harland, P.W.; Cradock, S.; Thynne, J.C.J.,
Positive- and negative-ion formation due to the electron bombardment of germanium tetrafluoride,
Int. J. Mass Spectrom. Ion Phys., 1972, 10, 169. [all data]