HCrO3 radical anion
- Formula: CrHO3-
- Molecular weight: 101.0028

Gas phase thermochemistry data

Data compiled by: John E. Bartmess
Quantity | Value | Units | Method | Reference | Comment |
---|---|---|---|---|---|
ΔfH°gas | -1132. ± 40. | kJ/mol | TDEq | Miller, 1972 |

References

Miller, 1972
Miller, E.S.,
Electron attachment and compound formation in flames. V. Negative ion formation in flames containing chromium and potassium,
J. Chem. Phys., 1972, 57, 2354. [all data]