2-Ethylanthraquinone anion

Gas phase thermochemistry data

Data compiled by: John E. Bartmess

Quantity Value Units Method Reference Comment
Δfgas-280. ± 14.kJ/molR-EAHeinis, Chowdhury, et al., 1988ΔGea(423 K) = -34.7 kcal/mol; ΔSea(estimated) = -2.9 eu

References

Heinis, Chowdhury, et al., 1988
Heinis, T.; Chowdhury, S.; Scott, S.L.; Kebarle, P., Electron Affinities of Benzo-, Naphtho-, and Anthraquinones Determined from Gas-Phase Equilibria Measurements, J. Am. Chem. Soc., 1988, 110, 2, 400, https://doi.org/10.1021/ja00210a015 . [all data]