1-Nitronaphthalene anion
- Formula: C10H7NO2-
- Molecular weight: 173.1686

Gas phase thermochemistry data

Data compiled by: John E. Bartmess
Quantity | Value | Units | Method | Reference | Comment |
---|---|---|---|---|---|
ΔfH°gas | -1.7 ± 2.6 | kcal/mol | R-EA | Heinis, Chowdhury, et al., 1993 | ΔGea(423 K)= -27.9 kcal/mol ΔSea=-0.9 |

Reaction thermochemistry data

Data compiled by: John E. Bartmess
Individual Reactions
C10H7NO2- + = C10H7F4NO2Si-
By formula: C10H7NO2- + F4Si = C10H7F4NO2Si-
Quantity | Value | Units | Method | Reference | Comment |
---|---|---|---|---|---|
ΔrG° | 10.20 ± 0.60 | kcal/mol | IMRE | Williamson, Knighton, et al., 2001 | gas phase; at 150 C |

Ion clustering data

Data compiled by: John E. Bartmess
Clustering reactions
C10H7NO2- + = C10H7F4NO2Si-
By formula: C10H7NO2- + F4Si = C10H7F4NO2Si-
Quantity | Value | Units | Method | Reference | Comment |
---|---|---|---|---|---|
ΔrG° | 10.20 ± 0.60 | kcal/mol | IMRE | Williamson, Knighton, et al., 2001 | gas phase; at 150 C |

References

Heinis, Chowdhury, et al., 1993
Heinis, T.; Chowdhury, S.; Kebarle, P.,
Electron Affinities of Naphthalene, Anthracene and Substituted Naphthalenes and Anthracenes,
Org. Mass Spectrom., 1993, 28, 4, 358, https://doi.org/10.1002/oms.1210280416
. [all data]
Williamson, Knighton, et al., 2001
Williamson, D.H.; Knighton, W.B.; Grimsrud, E.P.,
Lewis acid-base interactions of SiF4 with molecular anions formed by electron capture reactions,
Int. J. Mass Spectrom., 2001, 206, 1-2, 53-61, https://doi.org/10.1016/S1387-3806(00)00388-2
. [all data]