3-Nitrobiphenyl anion
- Formula: C12H9NO2-
- Molecular weight: 199.2059

Gas phase thermochemistry data

Data compiled by: John E. Bartmess
Quantity | Value | Units | Method | Reference | Comment |
---|---|---|---|---|---|
ΔfH°gas | 13.3 ± 2.5 | kcal/mol | R-EA | Chowdhury, Kishi, et al., 1989 | ΔGea(423 K) = -25.1 kcal/mol, ΔS = -2 eu est |

References

Chowdhury, Kishi, et al., 1989
Chowdhury, S.; Kishi, H.; Dillow, G.W.; Kebarle, P.,
Electron Affinities of Substituted Nitrobenzenes,
Can. J. Chem., 1989, 67, 4, 603, https://doi.org/10.1139/v89-091
. [all data]