Benzonitrile, 2-nitro- anion
- Formula: C7H4N2O2-
- Molecular weight: 148.1194

Reaction thermochemistry data

Data compiled as indicated in comments:
B - John E. Bartmess
M - Michael M. Meot-Ner (Mautner) and Sharon G. Lias
Individual Reactions
By formula: C7H4N2O2- + C4H8O = (C7H4N2O2- • C4H8O)
Quantity | Value | Units | Method | Reference | Comment |
---|---|---|---|---|---|
ΔrG° | 15. ± 6.7 | kJ/mol | IMRE | Chowdhury, Grimsrud, et al., 1987 | gas phase; Free energy affinity at 35°C.; B |
Free energy of reaction
ΔrG° (kJ/mol) | T (K) | Method | Reference | Comment |
---|---|---|---|---|
15. | 308. | PHPMS | Chowdhury, 1987 | gas phase; M |
By formula: C7H4N2O2- + CH4O = (C7H4N2O2- • CH4O)
Quantity | Value | Units | Method | Reference | Comment |
---|---|---|---|---|---|
ΔrG° | 19. ± 6.7 | kJ/mol | IMRE | Chowdhury, Grimsrud, et al., 1987 | gas phase; Free energy affinity at 70°C.; B |
Free energy of reaction
ΔrG° (kJ/mol) | T (K) | Method | Reference | Comment |
---|---|---|---|---|
19. | 343. | PHPMS | Chowdhury, 1987 | gas phase; M |
By formula: C7H4N2O2- + C2H6OS = (C7H4N2O2- • C2H6OS)
Quantity | Value | Units | Method | Reference | Comment |
---|---|---|---|---|---|
ΔrG° | 28. ± 6.7 | kJ/mol | IMRE | Chowdhury, Grimsrud, et al., 1987 | gas phase; Free energy affinity at 70°C.; B |
Free energy of reaction
ΔrG° (kJ/mol) | T (K) | Method | Reference | Comment |
---|---|---|---|---|
28. | 343. | PHPMS | Chowdhury, 1987 | gas phase; M |
By formula: C7H4N2O2- + C3H7NO = (C7H4N2O2- • C3H7NO)
Quantity | Value | Units | Method | Reference | Comment |
---|---|---|---|---|---|
ΔrG° | 20. ± 6.7 | kJ/mol | IMRE | Chowdhury, Grimsrud, et al., 1987 | gas phase; Free energy affinity at 70°C.; B |
Free energy of reaction
ΔrG° (kJ/mol) | T (K) | Method | Reference | Comment |
---|---|---|---|---|
20. | 343. | PHPMS | Chowdhury, 1987 | gas phase; M |
By formula: C7H4N2O2- + C2H3N = (C7H4N2O2- • C2H3N)
Quantity | Value | Units | Method | Reference | Comment |
---|---|---|---|---|---|
ΔrG° | 22. ± 6.7 | kJ/mol | IMRE | Chowdhury, Grimsrud, et al., 1987 | gas phase; Free energy affinity at 70°C.; B |
Free energy of reaction
ΔrG° (kJ/mol) | T (K) | Method | Reference | Comment |
---|---|---|---|---|
22. | 343. | PHPMS | Chowdhury, 1987 | gas phase; M |
C7H4N2O2- + = C7H4F4N2O2Si-
By formula: C7H4N2O2- + F4Si = C7H4F4N2O2Si-
Quantity | Value | Units | Method | Reference | Comment |
---|---|---|---|---|---|
ΔrG° | 38.5 ± 2.5 | kJ/mol | IMRE | Williamson, Knighton, et al., 2001 | gas phase; at 150 C; B |

Ion clustering data

Data compiled as indicated in comments:
B - John E. Bartmess
M - Michael M. Meot-Ner (Mautner) and Sharon G. Lias
Clustering reactions
By formula: C7H4N2O2- + CH4O = (C7H4N2O2- • CH4O)
Quantity | Value | Units | Method | Reference | Comment |
---|---|---|---|---|---|
ΔrG° | 19. ± 6.7 | kJ/mol | IMRE | Chowdhury, Grimsrud, et al., 1987 | gas phase; Free energy affinity at 70°C.; B |
Free energy of reaction
ΔrG° (kJ/mol) | T (K) | Method | Reference | Comment |
---|---|---|---|---|
19. | 343. | PHPMS | Chowdhury, 1987 | gas phase; M |
By formula: C7H4N2O2- + C2H3N = (C7H4N2O2- • C2H3N)
Quantity | Value | Units | Method | Reference | Comment |
---|---|---|---|---|---|
ΔrG° | 22. ± 6.7 | kJ/mol | IMRE | Chowdhury, Grimsrud, et al., 1987 | gas phase; Free energy affinity at 70°C.; B |
Free energy of reaction
ΔrG° (kJ/mol) | T (K) | Method | Reference | Comment |
---|---|---|---|---|
22. | 343. | PHPMS | Chowdhury, 1987 | gas phase; M |
By formula: C7H4N2O2- + C2H6OS = (C7H4N2O2- • C2H6OS)
Quantity | Value | Units | Method | Reference | Comment |
---|---|---|---|---|---|
ΔrG° | 28. ± 6.7 | kJ/mol | IMRE | Chowdhury, Grimsrud, et al., 1987 | gas phase; Free energy affinity at 70°C.; B |
Free energy of reaction
ΔrG° (kJ/mol) | T (K) | Method | Reference | Comment |
---|---|---|---|---|
28. | 343. | PHPMS | Chowdhury, 1987 | gas phase; M |
By formula: C7H4N2O2- + C3H7NO = (C7H4N2O2- • C3H7NO)
Quantity | Value | Units | Method | Reference | Comment |
---|---|---|---|---|---|
ΔrG° | 20. ± 6.7 | kJ/mol | IMRE | Chowdhury, Grimsrud, et al., 1987 | gas phase; Free energy affinity at 70°C.; B |
Free energy of reaction
ΔrG° (kJ/mol) | T (K) | Method | Reference | Comment |
---|---|---|---|---|
20. | 343. | PHPMS | Chowdhury, 1987 | gas phase; M |
By formula: C7H4N2O2- + C4H8O = (C7H4N2O2- • C4H8O)
Quantity | Value | Units | Method | Reference | Comment |
---|---|---|---|---|---|
ΔrG° | 15. ± 6.7 | kJ/mol | IMRE | Chowdhury, Grimsrud, et al., 1987 | gas phase; Free energy affinity at 35°C.; B |
Free energy of reaction
ΔrG° (kJ/mol) | T (K) | Method | Reference | Comment |
---|---|---|---|---|
15. | 308. | PHPMS | Chowdhury, 1987 | gas phase; M |
C7H4N2O2- + = C7H4F4N2O2Si-
By formula: C7H4N2O2- + F4Si = C7H4F4N2O2Si-
Quantity | Value | Units | Method | Reference | Comment |
---|---|---|---|---|---|
ΔrG° | 38.5 ± 2.5 | kJ/mol | IMRE | Williamson, Knighton, et al., 2001 | gas phase; at 150 C; B |

References

Chowdhury, Grimsrud, et al., 1987
Chowdhury, S.; Grimsrud, E.P.; Kebarle, P.,
Bonding of Charged Delocalized Anions to Protic and Dipolar Aprotic Solvent Molecules,
J. Phys. Chem., 1987, 91, 10, 2551, https://doi.org/10.1021/j100294a021
. [all data]
Chowdhury, 1987
Chowdhury, S. Grimsrud,
Bonding of Charge Delocalized Anions to Protic and Dipolar Aprotic Solvents,
J. Phys. Chem., 1987, 91, 10, 2551, https://doi.org/10.1021/j100294a021
. [all data]
Williamson, Knighton, et al., 2001
Williamson, D.H.; Knighton, W.B.; Grimsrud, E.P.,
Lewis acid-base interactions of SiF4 with molecular anions formed by electron capture reactions,
Int. J. Mass Spectrom., 2001, 206, 1-2, 53-61, https://doi.org/10.1016/S1387-3806(00)00388-2
. [all data]