2-Nitro-α,α,α-trifluorotoluene anion
- Formula: C7H4F3NO2-
- Molecular weight: 191.1079

Gas phase thermochemistry data

Data compiled by: John E. Bartmess
Quantity | Value | Units | Method | Reference | Comment |
---|---|---|---|---|---|
ΔfH°gas | -175.1 ± 2.5 | kcal/mol | R-EA | Chowdhury and Kebarle, 1986 | ΔGea(423 K) = -29.9 kcal/mol; ΔSea (estimated) = -2 eu |

Reaction thermochemistry data

Data compiled by: John E. Bartmess
Individual Reactions
C7H4F3NO2- + = C7H4F7NO2Si-
By formula: C7H4F3NO2- + F4Si = C7H4F7NO2Si-
Quantity | Value | Units | Method | Reference | Comment |
---|---|---|---|---|---|
ΔrG° | 10.60 ± 0.60 | kcal/mol | IMRE | Williamson, Knighton, et al., 2001 | gas phase; at 150 C |

Ion clustering data

Data compiled by: John E. Bartmess
Clustering reactions
C7H4F3NO2- + = C7H4F7NO2Si-
By formula: C7H4F3NO2- + F4Si = C7H4F7NO2Si-
Quantity | Value | Units | Method | Reference | Comment |
---|---|---|---|---|---|
ΔrG° | 10.60 ± 0.60 | kcal/mol | IMRE | Williamson, Knighton, et al., 2001 | gas phase; at 150 C |

References

Chowdhury and Kebarle, 1986
Chowdhury, S.; Kebarle, P.,
Electron affinities of di- and tetracyanoethylene and cyanobenzenes based on measurements of gas-phase electron transfer equilibria,
J. Am. Chem. Soc., 1986, 108, 5453. [all data]
Williamson, Knighton, et al., 2001
Williamson, D.H.; Knighton, W.B.; Grimsrud, E.P.,
Lewis acid-base interactions of SiF4 with molecular anions formed by electron capture reactions,
Int. J. Mass Spectrom., 2001, 206, 1-2, 53-61, https://doi.org/10.1016/S1387-3806(00)00388-2
. [all data]