CF3CF2CF(CF3) anion

Gas phase ion energetics data

Data compiled by: John E. Bartmess

Electron affinity of neutral species

EAneutral (eV) Method Reference Comment
>3.20 ± 0.10EIAESpyrou, Hunter, et al., 1985From i-C5F12

References

Spyrou, Hunter, et al., 1985
Spyrou, S.M.; Hunter, S.R.; Christophorou, L.G., A study of the isomeric dependence of low-energy (<10 eV) electron attachment: Perfluoroalkanes, J. Chem. Phys., 1985, 83, 641. [all data]