cerium triiodide anion
- Formula: CeI3-
- Molecular weight: 520.830

Gas phase thermochemistry data

Data compiled by: John E. Bartmess
Quantity | Value | Units | Method | Reference | Comment |
---|---|---|---|---|---|
ΔfH°gas | <-367.9 | kJ/mol | R-EA | Chantry, 1976 | CeI2- + CeI3 ->. |

References

Chantry, 1976
Chantry, P.J.,
Negative Ion Formation in Cerium Triiodide,
J. Chem. Phys., 1976, 65, 11, 4412, https://doi.org/10.1063/1.432992
. [all data]