HN=NO anion
- Formula: HN2O-
- Molecular weight: 45.0213

Reaction thermochemistry data

Data compiled by: John E. Bartmess
Individual Reactions
By formula: HN2O- + H+ = H2N2O
Quantity | Value | Units | Method | Reference | Comment |
---|---|---|---|---|---|
ΔrH° | 361.6 ± 2.3 | kcal/mol | G+TS | Sheldon, Ohair, et al., 1995 | gas phase; Acidity between PhCOMe, HCONHMe, near CF3CH2OH. Acid: H2N-NO |
Quantity | Value | Units | Method | Reference | Comment |
ΔrG° | 354.2 ± 2.0 | kcal/mol | IMRB | Sheldon, Ohair, et al., 1995 | gas phase; Acidity between PhCOMe, HCONHMe, near CF3CH2OH. Acid: H2N-NO |

Gas phase ion energetics data

Data compiled by: John E. Bartmess
Protonation reactions
By formula: HN2O- + H+ = H2N2O
Quantity | Value | Units | Method | Reference | Comment |
---|---|---|---|---|---|
ΔrH° | 361.6 ± 2.3 | kcal/mol | G+TS | Sheldon, Ohair, et al., 1995 | gas phase; Acidity between PhCOMe, HCONHMe, near CF3CH2OH. Acid: H2N-NO |
Quantity | Value | Units | Method | Reference | Comment |
ΔrG° | 354.2 ± 2.0 | kcal/mol | IMRB | Sheldon, Ohair, et al., 1995 | gas phase; Acidity between PhCOMe, HCONHMe, near CF3CH2OH. Acid: H2N-NO |

References

Sheldon, Ohair, et al., 1995
Sheldon, J.C.; Ohair, R.A.J.; Downard, K.M.; Gronert, S.; Krempp, M.; Depuy, C.H.; Bowie, J.H.,
A potential surface map of the H-/N2O system. The gas phase ion chemistry of HN2O-,
Aust. J. Chem., 1995, 48, 155. [all data]