CH2=NCH2 anion
- Formula: C2H4N-
- Molecular weight: 42.0604

Gas phase ion energetics data

Data compiled by: John E. Bartmess
Electron affinity of neutral species
EAneutral (eV) | Method | Reference | Comment |
---|---|---|---|
0.80 ± 0.30 | IMRB | Kass and DePuy, 1985 | EA: between cyclooctatetraene, SO2 |
Protonation reactions
C2H4N- + = C2H5N
By formula: C2H4N- + H+ = C2H5N
Quantity | Value | Units | Method | Reference | Comment |
---|---|---|---|---|---|
ΔrH° | 384.6 ± 5.1 | kcal/mol | G+TS | Kass and DePuy, 1985 | gas phase |
Quantity | Value | Units | Method | Reference | Comment |
ΔrG° | 378.0 ± 5.0 | kcal/mol | IMRB | Kass and DePuy, 1985 | gas phase |

Reaction thermochemistry data

Data compiled by: John E. Bartmess

Individual Reactions

C2H4N- + Hydrogen cation = C2H5N

By formula: C2H4N- + H+ = C2H5N

Quantity Value Units Method Reference Comment
Δr384.6 ± 5.1kcal/molG+TSKass and DePuy, 1985gas phase
Quantity Value Units Method Reference Comment
Δr378.0 ± 5.0kcal/molIMRBKass and DePuy, 1985gas phase

References

Kass and DePuy, 1985
Kass, S.R.; DePuy, C.H.,
Gas phase ion chemistry of azides. The generation of CH=N- and CH2=NCH2-,
J. Org. Chem., 1985, 50, 2874. [all data]