oNO2-C6H4CH2 anion
- Formula: C7H6NO2-
- Molecular weight: 136.1286

Reaction thermochemistry data

Data compiled by: John E. Bartmess
Individual Reactions
By formula: C7H6NO2- + H+ = C7H7NO2
Quantity | Value | Units | Method | Reference | Comment |
---|---|---|---|---|---|
ΔrH° | 356.0 ± 2.1 | kcal/mol | G+TS | Taft, 1987 | gas phase; value altered from reference due to change in acidity scale |
Quantity | Value | Units | Method | Reference | Comment |
ΔrG° | 348.6 ± 2.0 | kcal/mol | IMRE | Taft, 1987 | gas phase; value altered from reference due to change in acidity scale |

Gas phase ion energetics data

Data compiled by: John E. Bartmess
Protonation reactions
By formula: C7H6NO2- + H+ = C7H7NO2
Quantity | Value | Units | Method | Reference | Comment |
---|---|---|---|---|---|
ΔrH° | 356.0 ± 2.1 | kcal/mol | G+TS | Taft, 1987 | gas phase; value altered from reference due to change in acidity scale |
Quantity | Value | Units | Method | Reference | Comment |
ΔrG° | 348.6 ± 2.0 | kcal/mol | IMRE | Taft, 1987 | gas phase; value altered from reference due to change in acidity scale |

References

Taft, 1987
Taft, R.W.,
The Nature and Analysis of Substitutent Electronic Effects,
Personal communication. See also Prog. Phys. Org. Chem., 1987, 16, 1. [all data]