CO3 radical anion
- Formula: CO3-
- Molecular weight: 60.0094

Gas phase thermochemistry data

Data compiled by: John E. Bartmess
Quantity | Value | Units | Method | Reference | Comment |
---|---|---|---|---|---|
ΔfH°gas | -490. ± 50. | kJ/mol | AVG | N/A | Average of 6 out of 7 values; Individual data points |

Ion clustering data

Data compiled by: John E. Bartmess
Clustering reactions
CO3- + = C2O5-
By formula: CO3- + CO2 = C2O5-
Quantity | Value | Units | Method | Reference | Comment |
---|---|---|---|---|---|
ΔrH° | 24.7 ± 0.84 | kJ/mol | TDAs | Hiraoka and Yamabe, 1992 | gas phase |
ΔrH° | 29.7 ± 0.42 | kJ/mol | TDAs | Keesee, Lee, et al., 1980 | gas phase |
Quantity | Value | Units | Method | Reference | Comment |
ΔrG° | 4.2 ± 8.4 | kJ/mol | TDAs | Hiraoka and Yamabe, 1992 | gas phase |
ΔrG° | 2.5 ± 0.84 | kJ/mol | TDAs | Keesee, Lee, et al., 1980 | gas phase |
CO3- + = C3H4O5-
By formula: CO3- + C2H4O2 = C3H4O5-
Quantity | Value | Units | Method | Reference | Comment |
---|---|---|---|---|---|
ΔrG° | 47.28 ± 0.84 | kJ/mol | IMRE | Viidanoja, Reiner, et al., 1998 | gas phase |
CO3- + = CH2O4-
By formula: CO3- + H2O = CH2O4-
Quantity | Value | Units | Method | Reference | Comment |
---|---|---|---|---|---|
ΔrH° | 58.99 ± 0.84 | kJ/mol | TDAs | Keesee, Lee, et al., 1979 | gas phase |
ΔrH° | 48.1 ± 4.2 | kJ/mol | IMRE | Fehsenfeld and Ferguson, 1974 | gas phase |
ΔrH° | <161.1 | kJ/mol | PDis | Smith, Lee, et al., 1978 | gas phase |
Quantity | Value | Units | Method | Reference | Comment |
ΔrG° | 27.6 ± 1.7 | kJ/mol | TDAs | Keesee, Lee, et al., 1979 | gas phase |
ΔrG° | 28.0 ± 1.7 | kJ/mol | IMRE | Fehsenfeld and Ferguson, 1974 | gas phase |

Reaction thermochemistry data

Data compiled by: John E. Bartmess

Individual Reactions

CO3- + Water = CH2O4-

By formula: CO3- + H2O = CH2O4-

Quantity Value Units Method Reference Comment
Δr58.99 ± 0.84kJ/molTDAsKeesee, Lee, et al., 1979gas phase
Δr48.1 ± 4.2kJ/molIMREFehsenfeld and Ferguson, 1974gas phase
Δr<161.1kJ/molPDisSmith, Lee, et al., 1978gas phase
Quantity Value Units Method Reference Comment
Δr27.6 ± 1.7kJ/molTDAsKeesee, Lee, et al., 1979gas phase
Δr28.0 ± 1.7kJ/molIMREFehsenfeld and Ferguson, 1974gas phase

CO3- + Carbon dioxide = C2O5-

By formula: CO3- + CO2 = C2O5-

Quantity Value Units Method Reference Comment
Δr24.7 ± 0.84kJ/molTDAsHiraoka and Yamabe, 1992gas phase
Δr29.7 ± 0.42kJ/molTDAsKeesee, Lee, et al., 1980gas phase
Quantity Value Units Method Reference Comment
Δr4.2 ± 8.4kJ/molTDAsHiraoka and Yamabe, 1992gas phase
Δr2.5 ± 0.84kJ/molTDAsKeesee, Lee, et al., 1980gas phase

CO3- + Acetic acid = C3H4O5-

By formula: CO3- + C2H4O2 = C3H4O5-

Quantity Value Units Method Reference Comment
Δr47.28 ± 0.84kJ/molIMREViidanoja, Reiner, et al., 1998gas phase

Gas phase ion energetics data

Data compiled by: John E. Bartmess

Electron affinity of neutral species

EAneutral (eV) Method Reference Comment
>3.33999TherHunton, Hofmann, et al., 1985
>3.07885LPESNovich, Engelking, et al., 1979
3.10 ± 0.20CIDTTiernan and Wu, 1978
3.25 ± 0.15PDVestal and Mauclaire, 1977
>2.79954IMREDotan, Davidson, et al., 1977O3- + CO2 <=> CO3- + O2
2.69 ± 0.14PDHong, Woo, et al., 1977
1.80 ± 0.20PDBurt, 1972actually photodissociation, Snodgrass, Roehl, et al., 1990

References

Hiraoka and Yamabe, 1992
Hiraoka, K.; Yamabe, S.,
Formation of the Chelate Bonds in the Cluster O2(-)(CO2)n, CO3(-)(CO2)n, and NO2(-)(CO2)n,
J. Chem. Phys., 1992, 97, 1, 643, https://doi.org/10.1063/1.463560
. [all data]
Keesee, Lee, et al., 1980
Keesee, R.G.; Lee, N.; Castleman, A.W., Jr.,
Properties of clusters in the gas phase: V. Complexes of neutral molecules onto negative ions,
J. Chem. Phys., 1980, 73, 2195. [all data]
Viidanoja, Reiner, et al., 1998
Viidanoja, J.; Reiner, T.; Arnold, F.,
Laboratory Investigations of Negative Ion-Molecule Reactions of Formic and Acetic Acid.,
Int. J. Mass Spectrom., 1998, 181, 1-3, 31, https://doi.org/10.1016/S1387-3806(98)14151-9
. [all data]
Keesee, Lee, et al., 1979
Keesee, R.G.; Lee, N.; Castleman Jr.,
Properties of Clusters in the Gas Phase. 3. Hydration Complexes of CO3- and HCO3-,
J. Am. Chem. Soc., 1979, 101, 10, 2599, https://doi.org/10.1021/ja00504a015
. [all data]
Fehsenfeld and Ferguson, 1974
Fehsenfeld, F.C.; Ferguson, E.E.,
Laboratory studies of negative ion reactions with atmospheric trace constituents,
J. Chem. Phys., 1974, 61, 3181. [all data]
Smith, Lee, et al., 1978
Smith, G.P.; Lee, L.C.; Cosby, P.C.; Peterson, J.R.; Moseley, J.T.,
Photodissociation and photodetachment of molecular negative ions. V. Atmospheric ions from 7000 to 8400 A),
J. Chem. Phys., 1978, 68, 3818. [all data]