2,4-C2B5H6 anion
- Formula: C2H6B5-
- Molecular weight: 84.125

Reaction thermochemistry data

Data compiled by: John E. Bartmess
Individual Reactions
C2H6B5- + = C2H7B5
By formula: C2H6B5- + H+ = C2H7B5
Quantity | Value | Units | Method | Reference | Comment |
---|---|---|---|---|---|
ΔrH° | <1891.2 | kJ/mol | EIAE | Onak, Howard, et al., 1973 | gas phase; From closo-2,4-C2B5H7. Computations indicate dHacid ca. 371 kcal/mol |

Gas phase ion energetics data

Data compiled by: John E. Bartmess
Protonation reactions
C2H6B5- + = C2H7B5
By formula: C2H6B5- + H+ = C2H7B5
Quantity | Value | Units | Method | Reference | Comment |
---|---|---|---|---|---|
ΔrH° | <1891.2 | kJ/mol | EIAE | Onak, Howard, et al., 1973 | gas phase; From closo-2,4-C2B5H7. Computations indicate dHacid ca. 371 kcal/mol |

References

Onak, Howard, et al., 1973
Onak, T.; Howard, J.; Brown, C.,
Negative Ion Mass Spectrometry of closo-Carboranes, J. Chem. Soc. Dalton 76, 1973. [all data]