1,5-C2B3H4 anion
- Formula: C2H4B3-
- Molecular weight: 60.487

Reaction thermochemistry data

Data compiled by: John E. Bartmess
Individual Reactions
C2H4B3- + = C2H5B3
By formula: C2H4B3- + H+ = C2H5B3
Quantity | Value | Units | Method | Reference | Comment |
---|---|---|---|---|---|
ΔrH° | <1794.5 | kJ/mol | EIAE | Onak, Howard, et al., 1973 | gas phase; From closo-1,5-C2B3H5. G3MP2B3 calculations indicate a dHacid ca. 387 kcal/mol |

Gas phase ion energetics data

Data compiled by: John E. Bartmess
Protonation reactions
C2H4B3- + = C2H5B3
By formula: C2H4B3- + H+ = C2H5B3
Quantity | Value | Units | Method | Reference | Comment |
---|---|---|---|---|---|
ΔrH° | <1794.5 | kJ/mol | EIAE | Onak, Howard, et al., 1973 | gas phase; From closo-1,5-C2B3H5. G3MP2B3 calculations indicate a dHacid ca. 387 kcal/mol |

References

Onak, Howard, et al., 1973
Onak, T.; Howard, J.; Brown, C.,
Negative Ion Mass Spectrometry of closo-Carboranes, J. Chem. Soc. Dalton 76, 1973. [all data]