CNN radical anion
- Formula: CN2-
- Molecular weight: 40.0246

Gas phase thermochemistry data

Data compiled by: John E. Bartmess
Quantity | Value | Units | Method | Reference | Comment |
---|---|---|---|---|---|
ΔfH°gas | 424. ± 18. | kJ/mol | Acid | Clifford, Wenthold, et al., 1998 | between pyrazole, tBuSH |
ΔfH°gas | <648.52 | kJ/mol | IMRB | Dawson, Noest, et al., 1979 | O- + CH2N2 or (CN)2 ->. |

Reaction thermochemistry data

Data compiled by: John E. Bartmess
Individual Reactions
CN2- + = CHN2
Quantity | Value | Units | Method | Reference | Comment |
---|---|---|---|---|---|
ΔrH° | 1473. ± 18. | kJ/mol | G+TS | Clifford, Wenthold, et al., 1998 | gas phase; between pyrazole, tBuSH |
Quantity | Value | Units | Method | Reference | Comment |
ΔrG° | 1441. ± 17. | kJ/mol | IMRB | Clifford, Wenthold, et al., 1998 | gas phase; between pyrazole, tBuSH |

Gas phase ion energetics data

Data compiled by: John E. Bartmess
Protonation reactions
CN2- + = CHN2
Quantity | Value | Units | Method | Reference | Comment |
---|---|---|---|---|---|
ΔrH° | 1473. ± 18. | kJ/mol | G+TS | Clifford, Wenthold, et al., 1998 | gas phase; between pyrazole, tBuSH |
Quantity | Value | Units | Method | Reference | Comment |
ΔrG° | 1441. ± 17. | kJ/mol | IMRB | Clifford, Wenthold, et al., 1998 | gas phase; between pyrazole, tBuSH |

References

Clifford, Wenthold, et al., 1998
Clifford, E.P.; Wenthold, P.G.; Lineberger, W.C.; Peterssom, G.A.; Broaddus, K.M.; Kass, S.R.; Kato, S.,
Properties of Diazocarbene [CNN] and the diazomethyl Radical [HCNN] via Ion Chemistry and Spectroscopy,
J. Phys. Chem. A, 1998, 102, 36, 7100, https://doi.org/10.1021/jp9802735
. [all data]
Dawson, Noest, et al., 1979
Dawson, J.H.J.; Noest, A.J.; Nibbering, N.M.M.,
The gas phase allyl anion,
Int. J. Mass Spectrom. Ion Phys., 1979, 29, 205. [all data]