CO2..CO3 radical anion
- Formula: C2O5-
- Molecular weight: 104.0189

Gas phase thermochemistry data

Data compiled by: John E. Bartmess
Quantity | Value | Units | Method | Reference | Comment |
---|---|---|---|---|---|
ΔfH°gas | -220.45 | kcal/mol | Ther | Hiraoka and Yamabe, 1992 |

Ion clustering data

Data compiled by: John E. Bartmess
Clustering reactions
CO3- + = C2O5-
By formula: CO3- + CO2 = C2O5-
Quantity | Value | Units | Method | Reference | Comment |
---|---|---|---|---|---|
ΔrH° | 5.90 ± 0.20 | kcal/mol | TDAs | Hiraoka and Yamabe, 1992 | gas phase |
ΔrH° | 7.10 ± 0.10 | kcal/mol | TDAs | Keesee, Lee, et al., 1980 | gas phase |
Quantity | Value | Units | Method | Reference | Comment |
ΔrG° | 1.0 ± 2.0 | kcal/mol | TDAs | Hiraoka and Yamabe, 1992 | gas phase |
ΔrG° | 0.60 ± 0.20 | kcal/mol | TDAs | Keesee, Lee, et al., 1980 | gas phase |
C2O5- + 2 = C3O7-
By formula: C2O5- + 2CO2 = C3O7-
Quantity | Value | Units | Method | Reference | Comment |
---|---|---|---|---|---|
ΔrH° | 5.7 ± 1.0 | kcal/mol | TDAs | Hiraoka and Yamabe, 1992 | gas phase |
Quantity | Value | Units | Method | Reference | Comment |
ΔrG° | 0.4 ± 1.0 | kcal/mol | TDAs | Hiraoka and Yamabe, 1992 | gas phase |

Reaction thermochemistry data

Data compiled by: John E. Bartmess

Individual Reactions

CO3- + Carbon dioxide = C2O5-

By formula: CO3- + CO2 = C2O5-

Quantity Value Units Method Reference Comment
Δr24.7 ± 0.84kJ/molTDAsHiraoka and Yamabe, 1992gas phase
Δr29.7 ± 0.42kJ/molTDAsKeesee, Lee, et al., 1980gas phase
Quantity Value Units Method Reference Comment
Δr4.2 ± 8.4kJ/molTDAsHiraoka and Yamabe, 1992gas phase
Δr2.5 ± 0.84kJ/molTDAsKeesee, Lee, et al., 1980gas phase

C2O5- + 2Carbon dioxide = C3O7-

By formula: C2O5- + 2CO2 = C3O7-

Quantity Value Units Method Reference Comment
Δr24. ± 4.2kJ/molTDAsHiraoka and Yamabe, 1992gas phase
Quantity Value Units Method Reference Comment
Δr2. ± 4.2kJ/molTDAsHiraoka and Yamabe, 1992gas phase

References

Hiraoka and Yamabe, 1992
Hiraoka, K.; Yamabe, S.,
Formation of the Chelate Bonds in the Cluster O2(-)(CO2)n, CO3(-)(CO2)n, and NO2(-)(CO2)n,
J. Chem. Phys., 1992, 97, 1, 643, https://doi.org/10.1063/1.463560
. [all data]
Keesee, Lee, et al., 1980
Keesee, R.G.; Lee, N.; Castleman, A.W., Jr.,
Properties of clusters in the gas phase: V. Complexes of neutral molecules onto negative ions,
J. Chem. Phys., 1980, 73, 2195. [all data]