MeCO2H..MeCO2 anion
- Formula: C4H7O4-
- Molecular weight: 119.0965

Gas phase thermochemistry data

Data compiled by: John E. Bartmess
Quantity | Value | Units | Method | Reference | Comment |
---|---|---|---|---|---|
ΔfH°gas | -1059. ± 13. | kJ/mol | Ther | Meot-Ner and Sieck, 1986 |

Reaction thermochemistry data

Data compiled by: John E. Bartmess
Individual Reactions
C4H7O4- + + 2
= C4H9O5-
By formula: C4H7O4- + H2O + 2H2O = C4H9O5-
Quantity | Value | Units | Method | Reference | Comment |
---|---|---|---|---|---|
ΔrH° | 49.4 ± 2.9 | kJ/mol | N/A | Meot-ner, Elmore, et al., 1999 | gas phase |
Quantity | Value | Units | Method | Reference | Comment |
ΔrG° | 21.7 | kJ/mol | TDAs | Meot-ner, Elmore, et al., 1999 | gas phase |

Ion clustering data

Data compiled by: John E. Bartmess
Clustering reactions
C4H7O4- + + 2
= C4H9O5-
By formula: C4H7O4- + H2O + 2H2O = C4H9O5-
Quantity | Value | Units | Method | Reference | Comment |
---|---|---|---|---|---|
ΔrH° | 49.4 ± 2.9 | kJ/mol | N/A | Meot-ner, Elmore, et al., 1999 | gas phase |
Quantity | Value | Units | Method | Reference | Comment |
ΔrG° | 21.7 | kJ/mol | TDAs | Meot-ner, Elmore, et al., 1999 | gas phase |

References

Meot-Ner and Sieck, 1986
Meot-Ner, M.; Sieck, L.W.,
The ionic hydrogen bond and ion solvation. 5. OH...O- bonds. Gas phase solvation and clustering of alkoxide and carboxylate anions,
J. Am. Chem. Soc., 1986, 108, 7525. [all data]
Meot-ner, Elmore, et al., 1999
Meot-ner, M.; Elmore, D.E.; Scheiner, S.,
Ionic Hydrogen Bond Effects on the Acidities, Basicities, Solvation, Solvent Bridging and Self-assembly of Carboxylic Groups,
J. Am. Chem. Soc., 1999, 121, 33, 7625, https://doi.org/10.1021/ja982173i
. [all data]